Target
Tyrosine-protein kinase Lck
Ligand
BDBM50112926
Substrate
Meas. Tech.
ChEBML_221484
IC50
7.4±n/a nM
Citation
 Chen, PNorris, DIwanowicz, EJSpergel, SHLin, JGu, HHShen, ZWityak, JLin, TAPang, SDe Fex, HFPitt, SShen, DRDoweyko, AMBassolino, DARoberge, JYPoss, MAChen, BCSchieven, GLBarrish, JC Discovery and initial SAR of imidazoquinoxalines as inhibitors of the Src-family kinase p56(Lck). Bioorg Med Chem Lett 12:1361-4 (2002)  
Target
Name:
Tyrosine-protein kinase Lck
Synonyms:
2.7.10.2 LCK_HUMAN Leukocyte C-terminal Src kinase Lymphocyte-specific protein tyrosine kinase Protein YT16 Proto-oncogene tyrosine-protein kinase LCK T cell-specific protein-tyrosine kinase
Type:
Mol. Mass.:
57987.83
Organism:
Homo sapiens (Human)
Description:
P06239
Residue:
509
  
Inhibitor
Name:
BDBM50112926
Synonyms:
(2-Chloro-6-methyl-phenyl)-(6,7-dimethoxy-1-methyl-imidazo[1,5-a]quinoxalin-4-yl)-amine N-(2-chloro-6-methylphenyl)-6,7-dimethoxy-1-methylimidazo[1,5-a]quinoxalin-4-amine
Type:
Small organic molecule
Emp. Form.:
C20H19ClN4O2
Mol. Mass.:
382.843
SMILES:
COc1ccc2c(nc(Nc3c(C)cccc3Cl)c3cnc(C)n23)c1OC
: