Target
Tyrosine-protein kinase Lck
Ligand
BDBM50112938
Substrate
Meas. Tech.
ChEBML_221484
IC50
4.3±n/a nM
Citation
 Chen, PNorris, DIwanowicz, EJSpergel, SHLin, JGu, HHShen, ZWityak, JLin, TAPang, SDe Fex, HFPitt, SShen, DRDoweyko, AMBassolino, DARoberge, JYPoss, MAChen, BCSchieven, GLBarrish, JC Discovery and initial SAR of imidazoquinoxalines as inhibitors of the Src-family kinase p56(Lck). Bioorg Med Chem Lett 12:1361-4 (2002)  
Target
Name:
Tyrosine-protein kinase Lck
Synonyms:
2.7.10.2 LCK_HUMAN Leukocyte C-terminal Src kinase Lymphocyte-specific protein tyrosine kinase Protein YT16 Proto-oncogene tyrosine-protein kinase LCK T cell-specific protein-tyrosine kinase
Type:
Mol. Mass.:
57987.83
Organism:
Homo sapiens (Human)
Description:
P06239
Residue:
509
  
Inhibitor
Name:
BDBM50112938
Synonyms:
(E)-4-(2-chloro-6-methylphenylamino)-6,7-dimethoxyimidazo[1,5-a]quinoxaline-1-carbaldehyde oxime CHEMBL29191
Type:
Small organic molecule
Emp. Form.:
C20H18ClN5O3
Mol. Mass.:
411.842
SMILES:
COc1ccc2c(nc(Nc3c(C)cccc3Cl)c3cnc(CN=O)n23)c1OC
: