Target
Oxytocin receptor
Ligand
BDBM50029649
Substrate
Meas. Tech.
ChEMBL_149054 (CHEMBL761408)
Ki
6.3±n/a nM
Citation
 Wyatt, PGAllen, MJChilcott, JGardner, CJLivermore, DGMordaunt, JENerozzi, FPatel, MPerren, MJWeingarten, GGShabbir, SWoollard, PMZhou, P Identification of potent and selective oxytocin antagonists. Part 2: further investigation of benzofuran derivatives. Bioorg Med Chem Lett 12:1405-11 (2002)  
Target
Name:
Oxytocin receptor
Synonyms:
OT-R OXYR_HUMAN | Oxytocin
Type:
Enzyme Catalytic Domain
Mol. Mass.:
42793.26
Organism:
Homo sapiens (Human)
Description:
Oxytocin OXTR HEK293::B2R9L7
Residue:
389
  
Inhibitor
Name:
BDBM50029649
Synonyms:
1-(1-(4-(1-acetylpiperidin-4-yloxy)-2-methoxybenzoyl)piperidin-4-yl)-1H-benzo[d][1,3]oxazin-2(4H)-one CHEMBL24781 | L-371257
Type:
Small organic molecule
Emp. Form.:
C28H33N3O6
Mol. Mass.:
507.5781
SMILES:
COc1cc(OC2CCN(CC2)C(C)=O)ccc1C(=O)N1CCC(CC1)N1C(=O)OCc2ccccc12
: