Target
Adenosine receptor A2b
Ligand
BDBM50008405
Substrate
Meas. Tech.
ChEMBL_30305 (CHEMBL636450)
Ki
40±n/a nM
Citation
 Kim, SAMarshall, MAMelman, NKim, HSMüller, CELinden, JJacobson, KA Structure-activity relationships at human and rat A2B adenosine receptors of xanthine derivatives substituted at the 1-, 3-, 7-, and 8-positions. J Med Chem 45:2131-8 (2002)  
Target
Name:
Adenosine receptor A2b
Synonyms:
AA2BR_HUMAN ADORA2B Adenosine receptors A2b | Adenosine receptors; A2a & A2b
Type:
G Protein-Coupled Receptor (GPCR)
Mol. Mass.:
36341.22
Organism:
Homo sapiens (Human)
Description:
Residue:
332
  
Inhibitor
Name:
BDBM50008405
Synonyms:
2-(4-(2,6-dioxo-1,3-dipropyl-2,3,6,7-tetrahydro-1H-purin-8-yl)phenoxy)acetic acid [4-(2,6-Dioxo-1,3-dipropyl-2,3,6,7-tetrahydro-1H-purin-8-yl)-phenoxy]-acetic acid | [4-(2,6-Dioxo-1,3-dipropyl-2,3,6,9-tetrahydro-1H-purin-8-yl)-phenoxy]-acetic acid
Type:
Small organic molecule
Emp. Form.:
C19H22N4O5
Mol. Mass.:
386.4018
SMILES:
CCCn1c2nc([nH]c2c(=O)n(CCC)c1=O)-c1ccc(OCC(O)=O)cc1
: