Target
Adenosine receptor A2b
Ligand
BDBM50113235
Substrate
Meas. Tech.
ChEMBL_30739 (CHEMBL649770)
Ki
10200±n/a nM
Citation
 Kim, SAMarshall, MAMelman, NKim, HSMüller, CELinden, JJacobson, KA Structure-activity relationships at human and rat A2B adenosine receptors of xanthine derivatives substituted at the 1-, 3-, 7-, and 8-positions. J Med Chem 45:2131-8 (2002)  
Target
Name:
Adenosine receptor A2b
Synonyms:
AA2BR_RAT Adora2b
Type:
PROTEIN
Mol. Mass.:
36378.84
Organism:
Rattus norvegicus
Description:
ChEMBL_32934
Residue:
332
  
Inhibitor
Name:
BDBM50113235
Synonyms:
1-Benzyl-3-methyl-3,7-dihydro-purine-2,6-dione | CHEMBL63944
Type:
Small organic molecule
Emp. Form.:
C13H12N4O2
Mol. Mass.:
256.26
SMILES:
Cn1c2nc[nH]c2c(=O)n(Cc2ccccc2)c1=O
: