Target
Prothrombin
Ligand
BDBM50113792
Substrate
Meas. Tech.
ChEMBL_208531 (CHEMBL813625)
Ki
2.17±n/a nM
Citation
 Danilewicz, JCAbel, SMBrown, ADFish, PVHawkeswood, EHolland, SJJames, KMcElroy, ABOverington, JPowling, MJRance, DJ Design of selective thrombin inhibitors based on the (R)-Phe-Pro-Arg sequence. J Med Chem 45:2432-53 (2002)  
Target
Name:
Prothrombin
Synonyms:
Activation peptide fragment 1 Coagulation factor II Prothrombin precursor Thrombin heavy chain | Thrombin light chain
Type:
Protein
Mol. Mass.:
70029.57
Organism:
Homo sapiens (Human)
Description:
P00734
Residue:
622
  
Inhibitor
Name:
BDBM50113792
Synonyms:
CHEMBL81521 | S-4-{2-[2-(1-Carbamimidoyl-piperidin-4-yloxy)-ethyl]-piperidin-1-yl}-3-(cyclohexyl-methyl-amino)-4-oxo-butyric acid
Type:
Small organic molecule
Emp. Form.:
C24H43N5O4
Mol. Mass.:
465.6293
SMILES:
CN([C@@H](CC(O)=O)C(=O)N1CCCC[C@H]1CCOC1CCN(CC1)C(N)=N)C1CCCCC1
: