Target
Vasopressin V1a receptor
Ligand
BDBM50114031
Substrate
Meas. Tech.
ChEMBL_214412 (CHEMBL820276)
Ki
0.53±n/a nM
Citation
 Kakefuda, ASuzuki, TTobe, TTsukada, JTahara, ASakamoto, STsukamoto, S Synthesis and pharmacological evaluation of 5-(4-biphenyl)-3-methyl-4-phenyl-1,2,4-triazole derivatives as a novel class of selective antagonists for the human vasopressin V(1A) receptor. J Med Chem 45:2589-98 (2002)  
Target
Name:
Vasopressin V1a receptor
Synonyms:
AVPR V1a AVPR1A V1AR_HUMAN VASOPRESSIN V1A Vasopressin V1 receptor Vasopressin receptor
Type:
Receptor
Mol. Mass.:
46820.18
Organism:
Homo sapiens (Human)
Description:
P37288
Residue:
418
  
Inhibitor
Name:
BDBM50114031
Synonyms:
(2S)-1-[(2R,3S)-5-chloro-3-(2-chlorophenyl)-1-(3,4-dimethoxybenzenesulfonyl)-3-hydroxy-2,3-dihydro-1H-indole-2-carbonyl]-pyrrolidine-2-carboxamide 1-[5-Chloro-3-(2-chloro-phenyl)-1-(3,4-dimethoxy-benzenesulfonyl)-3-hydroxy-2,3-dihydro-1H-indole-2-carbonyl]-pyrrolidine-2-carboxylic acid amide Relcovaptan
Type:
Small organic molecule
Emp. Form.:
C28H27Cl2N3O7S
Mol. Mass.:
620.501
SMILES:
COc1ccc(cc1OC)S(=O)(=O)N1[C@@H](C(=O)N2CCC[C@H]2C(N)=O)[C@](O)(c2cc(Cl)ccc12)c1ccccc1Cl
: