Target
Coagulation factor X
Ligand
BDBM50114457
Substrate
Meas. Tech.
ChEBML_48983
IC50
623±n/a nM
Citation
 Zhang, PZuckett, JFWoolfrey, JTran, KHuang, BWong, PSinha, UPark, GReed, AMalinowski, JHollenbach, SScarborough, RMZhu, BY Design, synthesis, and SAR of monobenzamidines and aminoisoquinolines as factor Xa inhibitors. Bioorg Med Chem Lett 12:1657-61 (2002)  
Target
Name:
Coagulation factor X
Synonyms:
Activated coagulation factor X (FXa) Coagulation factor X precursor F10 Factor X heavy chain Factor Xa Stuart-Prower factor
Type:
Enzyme
Mol. Mass.:
54726.60
Organism:
Homo sapiens (Human)
Description:
Residue:
488
  
Inhibitor
Name:
BDBM50114457
Synonyms:
2-{2-[2-(1-Amino-isoquinolin-7-yloxy)-1-phenyl-ethyl]-1-oxo-2,3-dihydro-1H-isoindol-5-yl}-benzenesulfonamide | CHEMBL296334
Type:
Small organic molecule
Emp. Form.:
C31H26N4O4S
Mol. Mass.:
550.628
SMILES:
Nc1nccc2ccc(OCC(N3Cc4cc(ccc4C3=O)-c3ccccc3S(N)(=O)=O)c3ccccc3)cc12
: