Target
Coagulation factor X
Ligand
BDBM50114465
Substrate
Meas. Tech.
ChEBML_48983
IC50
14±n/a nM
Citation
 Zhang, PZuckett, JFWoolfrey, JTran, KHuang, BWong, PSinha, UPark, GReed, AMalinowski, JHollenbach, SScarborough, RMZhu, BY Design, synthesis, and SAR of monobenzamidines and aminoisoquinolines as factor Xa inhibitors. Bioorg Med Chem Lett 12:1657-61 (2002)  
Target
Name:
Coagulation factor X
Synonyms:
Activated coagulation factor X (FXa) Coagulation factor X precursor F10 Factor X heavy chain Factor Xa Stuart-Prower factor
Type:
Enzyme
Mol. Mass.:
54726.60
Organism:
Homo sapiens (Human)
Description:
Residue:
488
  
Inhibitor
Name:
BDBM50114465
Synonyms:
2'-Sulfamoyl-biphenyl-4-carboxylic acid benzyl-[2-(3-carbamimidoyl-phenoxy)-ethyl]-amide | CHEMBL296514
Type:
Small organic molecule
Emp. Form.:
C29H28N4O4S
Mol. Mass.:
528.622
SMILES:
NC(=N)c1cccc(OCCN(Cc2ccccc2)C(=O)c2ccc(cc2)-c2ccccc2S(N)(=O)=O)c1
: