Target
Coagulation factor X
Ligand
BDBM50114488
Substrate
Meas. Tech.
ChEBML_48983
IC50
7.8±n/a nM
Citation
 Zhang, PZuckett, JFWoolfrey, JTran, KHuang, BWong, PSinha, UPark, GReed, AMalinowski, JHollenbach, SScarborough, RMZhu, BY Design, synthesis, and SAR of monobenzamidines and aminoisoquinolines as factor Xa inhibitors. Bioorg Med Chem Lett 12:1657-61 (2002)  
Target
Name:
Coagulation factor X
Synonyms:
Activated coagulation factor X (FXa) Coagulation factor X precursor F10 Factor X heavy chain Factor Xa Stuart-Prower factor
Type:
Enzyme
Mol. Mass.:
54726.60
Organism:
Homo sapiens (Human)
Description:
Residue:
488
  
Inhibitor
Name:
BDBM50114488
Synonyms:
2'-Sulfamoyl-biphenyl-4-carboxylic acid [2-(3-carbamimidoyl-phenoxy)-ethyl]-furan-3-ylmethyl-amide | CHEMBL296005
Type:
Small organic molecule
Emp. Form.:
C27H26N4O5S
Mol. Mass.:
518.584
SMILES:
NC(=N)c1cccc(OCCN(Cc2ccoc2)C(=O)c2ccc(cc2)-c2ccccc2S(N)(=O)=O)c1
: