Target
Coagulation factor X
Ligand
BDBM50085393
Substrate
Meas. Tech.
ChEBML_49304
Ki
0.500000±n/a nM
Citation
 Czekaj, MKlein, SIGuertin, KRGardner, CJZulli, ALPauls, HWSpada, APCheney, DLBrown, KDColussi, DJChu, VLeadley, RJDunwiddie, CT Optimization of the beta-aminoester class of factor Xa inhibitors. Part 1: P(4) and side-chain modifications for improved in vitro potency. Bioorg Med Chem Lett 12:1667-70 (2002)  
Target
Name:
Coagulation factor X
Synonyms:
Activated coagulation factor X (FXa) Coagulation factor X precursor F10 Factor X heavy chain Factor Xa Stuart-Prower factor
Type:
Enzyme
Mol. Mass.:
54726.60
Organism:
Homo sapiens (Human)
Description:
Residue:
488
  
Inhibitor
Name:
BDBM50085393
Synonyms:
(2R,3R)-2-(3-Carbamimidoyl-benzyl)-3-[(3'-carbamoyl-biphenyl-4-carbonyl)-amino]-butyric acid methyl ester | CHEMBL44050
Type:
Small organic molecule
Emp. Form.:
C27H28N4O4
Mol. Mass.:
472.5356
SMILES:
COC(=O)[C@H](Cc1cccc(c1)C(N)=N)[C@@H](C)NC(=O)c1ccc(cc1)-c1cccc(c1)C(N)=O
: