Target
Melatonin receptor type 1B
Ligand
BDBM50114718
Substrate
Meas. Tech.
ChEMBL_105263 (CHEMBL715855)
Ki
0.02±n/a nM
Citation
 Wallez, VDurieux-Poissonnier, SChavatte, PBoutin, JAAudinot, VNicolas, JPBennejean, CDelagrange, PRenard, PLesieur, D Synthesis and structure-affinity-activity relationships of novel benzofuran derivatives as MT(2) melatonin receptor selective ligands. J Med Chem 45:2788-800 (2002)  
Target
Name:
Melatonin receptor type 1B
Synonyms:
MTNR1B Mel-1B-R Melatonin 1B Melatonin receptor type 1B | Melatonin receptor type 2 (MT2)
Type:
Enzyme
Mol. Mass.:
40203.54
Organism:
Homo sapiens (Human)
Description:
P49286
Residue:
362
  
Inhibitor
Name:
BDBM50114718
Synonyms:
But-3-enoic acid [2-(5-methoxy-2-phenyl-benzofuran-3-yl)-ethyl]-amide | CHEMBL330137
Type:
Small organic molecule
Emp. Form.:
C21H21NO3
Mol. Mass.:
335.3963
SMILES:
COc1ccc2oc(c(CCNC(=O)CC=C)c2c1)-c1ccccc1
: