Target
Potassium voltage-gated channel subfamily H member 2
Ligand
BDBM50114956
Substrate
Meas. Tech.
ChEBML_205711
Ki
1000±n/a nM
Citation
 Cooper, LCCarlson, EJCastro, JLChicchi, GGDinnell, KDi Salvo, JElliott, JMHollingworth, GJKurtz, MMRidgill, MPRycroft, WTsao, KLSwain, CJ 4,4-Disubstituted cyclohexylamine NK(1) receptor antagonists II. Bioorg Med Chem Lett 12:1759-62 (2002)  
Target
Name:
Potassium voltage-gated channel subfamily H member 2
Synonyms:
1,3-beta-glucan synthase component GLS2 ERG Eag-related protein 1 Ether-a-go-go-related gene (HERG) Ether-a-go-go-related gene potassium channel 1 Ether-a-go-go-related gene potassium channel 1 (hERG1) Ether-a-go-go-related protein 1 H-ERG KCNH2 Potassium voltage-gated channel subfamily H member 2 (hERG) Voltage-gated potassium channel subunit Kv11.1 hERG Potassium Channel 1 | putative potassium channel subunit
Type:
Multi-pass membrane protein
Mol. Mass.:
126672.65
Organism:
Homo sapiens (Human)
Description:
Q12809
Residue:
1159
  
Inhibitor
Name:
BDBM50114956
Synonyms:
2-(3,5-Bis-trifluoromethyl-phenyl)-N-[4-(1,4-dioxa-8-aza-spiro[4.5]dec-8-yl)-1-phenyl-cyclohexyl]-propionamide | CHEMBL297344
Type:
Small organic molecule
Emp. Form.:
C30H34F6N2O3
Mol. Mass.:
584.593
SMILES:
CC(C(=O)N[C@]1(CC[C@@H](CC1)N1CCC2(CC1)OCCO2)c1ccccc1)c1cc(cc(c1)C(F)(F)F)C(F)(F)F
: