Target
Beta-lactamase
Ligand
BDBM50115621
Substrate
Meas. Tech.
ChEMBL_35527 (CHEMBL649553)
Ki
320±n/a nM
Citation
 Powers, RAShoichet, BK Structure-based approach for binding site identification on AmpC beta-lactamase. J Med Chem 45:3222-34 (2002)  
Target
Name:
Beta-lactamase
Synonyms:
AMPC_ECOLI Beta-lactamase (AmpC) Cephalosporinase ampA | ampC
Type:
Protien
Mol. Mass.:
41561.62
Organism:
Escherichia coli
Description:
P00811
Residue:
377
  
Inhibitor
Name:
BDBM50115621
Synonyms:
(2-(thiophen-2-yl)acetamido)methylboronic acid CHEMBL320049 N-dihydroxyBoranylmethyl-2-thiophen-2-yl-acetamide
Type:
Small organic molecule
Emp. Form.:
C7H10BNO3S
Mol. Mass.:
199.035
SMILES:
OB(O)CNC(=O)Cc1cccs1
: