Target
Neprilysin
Ligand
BDBM50115837
Substrate
Meas. Tech.
ChEBML_144469
Ki
11±n/a nM
Citation
 Inguimbert, NPoras, HTeffo, FBeslot, FSelkti, MTomas, AScalbert, EBennejean, CRenard, PFournié-Zaluski, MCRoques, BP N-[2-(Indan-1-yl)-3-mercapto-propionyl] amino acids as highly potent inhibitors of the three vasopeptidases (NEP, ACE, ECE): In vitro and In vivo activities. Bioorg Med Chem Lett 12:2001-5 (2002)  
Target
Name:
Neprilysin
Synonyms:
Atriopeptidase CD_antigen=CD10 MME NEP_RABIT Neutral endopeptidase 24.11
Type:
Enzyme
Mol. Mass.:
85570.75
Organism:
Oryctolagus cuniculus (rabbit)
Description:
NEP was purified to homogeneity from rabbit kidney.
Residue:
750
  
Inhibitor
Name:
BDBM50115837
Synonyms:
2-[2-(5-Cyano-indan-1-yl)-3-mercapto-propionylamino]-3-(1H-indol-3-yl)-propionic acid | CHEMBL59674
Type:
Small organic molecule
Emp. Form.:
C24H23N3O3S
Mol. Mass.:
433.523
SMILES:
OC(=O)C(Cc1c[nH]c2ccccc12)NC(=O)C(CS)C1CCc2cc(ccc12)C#N
: