Target
Endothelin-converting enzyme 1
Ligand
BDBM50115850
Substrate
Meas. Tech.
ChEBML_64199
Ki
100±n/a nM
Citation
 Inguimbert, NPoras, HTeffo, FBeslot, FSelkti, MTomas, AScalbert, EBennejean, CRenard, PFournié-Zaluski, MCRoques, BP N-[2-(Indan-1-yl)-3-mercapto-propionyl] amino acids as highly potent inhibitors of the three vasopeptidases (NEP, ACE, ECE): In vitro and In vivo activities. Bioorg Med Chem Lett 12:2001-5 (2002)  
Target
Name:
Endothelin-converting enzyme 1
Synonyms:
ECE-1 ECE1_HUMAN Endothelin-converting enzyme 1 (ECE1)
Type:
Enzyme
Mol. Mass.:
87155.11
Organism:
Homo sapiens (Human)
Description:
P42892
Residue:
770
  
Inhibitor
Name:
BDBM50115850
Synonyms:
(S)-3-(1H-Indol-3-yl)-2-[(S)-3-mercapto-2-((R)-5-methoxy-indan-1-yl)-propionylamino]-propionic acid | CHEMBL304629
Type:
Small organic molecule
Emp. Form.:
C24H26N2O4S
Mol. Mass.:
438.539
SMILES:
COc1ccc2[C@H](CCc2c1)[C@H](CS)C(=O)N[C@@H](Cc1c[nH]c2ccccc12)C(O)=O
: