Target
Angiotensin-converting enzyme
Ligand
BDBM50115838
Substrate
Meas. Tech.
ChEBML_35382
Ki
18±n/a nM
Citation
 Inguimbert, NPoras, HTeffo, FBeslot, FSelkti, MTomas, AScalbert, EBennejean, CRenard, PFournié-Zaluski, MCRoques, BP N-[2-(Indan-1-yl)-3-mercapto-propionyl] amino acids as highly potent inhibitors of the three vasopeptidases (NEP, ACE, ECE): In vitro and In vivo activities. Bioorg Med Chem Lett 12:2001-5 (2002)  
Target
Name:
Angiotensin-converting enzyme
Synonyms:
ACE_RAT Angiotensin-converting enzyme | Dcp1
Type:
PROTEIN
Mol. Mass.:
150907.81
Organism:
Rattus norvegicus
Description:
ChEMBL_35219
Residue:
1313
  
Inhibitor
Name:
BDBM50115838
Synonyms:
2-[2-(5-Ethoxy-indan-1-yl)-3-mercapto-propionylamino]-3-(1H-indol-3-yl)-propionic acid | CHEMBL304218
Type:
Small organic molecule
Emp. Form.:
C25H28N2O4S
Mol. Mass.:
452.566
SMILES:
CCOc1ccc2C(CCc2c1)C(CS)C(=O)NC(Cc1c[nH]c2ccccc12)C(O)=O
: