Target
Glutamate receptor ionotropic, kainate 2
Ligand
BDBM50116040
Substrate
Meas. Tech.
ChEBML_72854
Ki
610±n/a nM
Citation
 Lubisch, WBehl, BHenn, CHofmann, HPReeb, JRegner, FVierling, M Pyrrolylquinoxalinediones carrying a piperazine residue represent highly potent and selective ligands to the homomeric kainate receptor GluR5. Bioorg Med Chem Lett 12:2113-6 (2002)  
Target
Name:
Glutamate receptor ionotropic, kainate 2
Synonyms:
EAA4 GLUR6 GRIK2_HUMAN GluR-6 Glutamate receptor 6 Glutamate receptor, ionotropic kainate 2 Glutamate-Kainate, GluR6
Type:
Enzyme Catalytic Domain
Mol. Mass.:
102592.78
Organism:
Homo sapiens (Human)
Description:
Q13002
Residue:
908
  
Inhibitor
Name:
BDBM50116040
Synonyms:
(7-{3-[3-(4-Nitro-phenyl)-ureidomethyl]-pyrrol-1-yl}-2,3-dioxo-6-trifluoromethyl-3,4-dihydro-2H-quinoxalin-1-yl)-acetic acid | CHEMBL13076
Type:
Small organic molecule
Emp. Form.:
C23H17F3N6O7
Mol. Mass.:
546.4123
SMILES:
OC(=O)Cn1c2cc(c(cc2[nH]c(=O)c1=O)C(F)(F)F)-n1ccc(CNC(=O)Nc2ccc(cc2)[N+]([O-])=O)c1
: