Target
Glutamate receptor ionotropic, kainate 1
Ligand
BDBM50116048
Substrate
Meas. Tech.
ChEBML_72853
Ki
12±n/a nM
Citation
 Lubisch, WBehl, BHenn, CHofmann, HPReeb, JRegner, FVierling, M Pyrrolylquinoxalinediones carrying a piperazine residue represent highly potent and selective ligands to the homomeric kainate receptor GluR5. Bioorg Med Chem Lett 12:2113-6 (2002)  
Target
Name:
Glutamate receptor ionotropic, kainate 1
Synonyms:
GLUR5 GRIK1_HUMAN Glutamate kainate Glutamate receptor ionotropic kainate 1 Glutamate-Kainate Grik1 protein | hmglur5 flipr
Type:
Enzyme Catalytic Domain
Mol. Mass.:
103984.96
Organism:
Homo sapiens (Human)
Description:
P39086
Residue:
918
  
Inhibitor
Name:
BDBM50116048
Synonyms:
CHEMBL67828 | {6-Nitro-2,3-dioxo-7-[3-(4-phenethyl-piperazin-1-ylmethyl)-pyrrol-1-yl]-3,4-dihydro-2H-quinoxalin-1-yl}-acetic acid
Type:
Small organic molecule
Emp. Form.:
C27H28N6O6
Mol. Mass.:
532.5478
SMILES:
OC(=O)Cn1c2cc(c(cc2[nH]c(=O)c1=O)[N+]([O-])=O)-n1ccc(CN2CCN(CCc3ccccc3)CC2)c1
: