Target
Caspase-3
Ligand
BDBM50116264
Substrate
Meas. Tech.
ChEBML_46684
Ki
26±n/a nM
Citation
 Willoughby, CABull, HGGarcia-Calvo, MJiang, JChapman, KTThornberry, NA Discovery of potent, selective human granzyme B inhibitors that inhibit CTL mediated apoptosis. Bioorg Med Chem Lett 12:2197-200 (2002)  
Target
Name:
Caspase-3
Synonyms:
Apopain CASP3 CPP-32 Caspase 3 Caspase-3 subunit p17 SCA-1 Yama protein | caspase-3 preproprotein
Type:
Hydrolase; heterotetramer of two heterodimers
Mol. Mass.:
31607.55
Organism:
Homo sapiens (Human)
Description:
Residue:
277
  
Inhibitor
Name:
BDBM50116264
Synonyms:
(S)-3-({(S)-(S)-5-[(S)-2-((S)-Acetyl-methyl-amino)-3-methyl-pentanoylamino]-4-oxo-1,2,4,5,6,7-hexahydro-azepino[3,2,1-hi]indole-2-carbonyl}-amino)-4-oxo-4-(5-phenyl-[1,3,4]oxadiazol-2-yl)-butyric acid | CHEMBL71654
Type:
Small organic molecule
Emp. Form.:
C34H38N6O8
Mol. Mass.:
658.7009
SMILES:
CC[C@H](C)[C@H](N(C)C(C)=O)C(=O)N[C@H]1CCc2cccc3C[C@H](N(c23)C1=O)C(=O)N[C@@H](CC(O)=O)C(=O)c1nnc(o1)-c1ccccc1
: