Target
Granzyme B
Ligand
BDBM50116270
Substrate
Meas. Tech.
ChEBML_72172
Ki
360±n/a nM
Citation
 Willoughby, CABull, HGGarcia-Calvo, MJiang, JChapman, KTThornberry, NA Discovery of potent, selective human granzyme B inhibitors that inhibit CTL mediated apoptosis. Bioorg Med Chem Lett 12:2197-200 (2002)  
Target
Name:
Granzyme B
Synonyms:
CGL1 CTLA1 GRB | GZMB
Type:
PROTEIN
Mol. Mass.:
27735.56
Organism:
Homo sapiens (Human)
Description:
ChEMBL_469245
Residue:
247
  
Inhibitor
Name:
BDBM50116270
Synonyms:
(2S,5S)-5-[(S)-2-(Acetyl-methyl-amino)-3-(S)-methyl-pentanoylamino]-4-oxo-1,2,4,5,6,7-hexahydro-azepino[3,2,1-hi]indole-2-carboxylic acid (3-hydroxy-isoxazol-5-ylmethyl)-amide | CHEMBL305418
Type:
Small organic molecule
Emp. Form.:
C26H33N5O6
Mol. Mass.:
511.5701
SMILES:
CC[C@H](C)[C@H](N(C)C(C)=O)C(=O)N[C@H]1CCc2cccc3C[C@H](N(c23)C1=O)C(=O)NCc1cc(=O)[nH]o1
: