Target
Matrix metalloproteinase-9
Ligand
BDBM50116275
Substrate
Meas. Tech.
ChEBML_71659
IC50
75000±n/a nM
Citation
 Wang, XChoe, YCraik, CSEllman, JA Design and synthesis of novel inhibitors of gelatinase B. Bioorg Med Chem Lett 12:2201-4 (2002)  
Target
Name:
Matrix metalloproteinase-9
Synonyms:
92 kDa gelatinase Clg4b Gelatinase B MMP9_MOUSE Matrix metalloproteinase-9 | Mmp9
Type:
PROTEIN
Mol. Mass.:
80529.41
Organism:
Mus musculus
Description:
ChEMBL_71659
Residue:
730
  
Inhibitor
Name:
BDBM50116275
Synonyms:
CHEMBL68315 | N-(2-Aminomethyl-3H-benzoimidazol-5-yl)-3-((E)-2,6-difluoro-phenyl)-acrylamide
Type:
Small organic molecule
Emp. Form.:
C17H14F2N4O
Mol. Mass.:
328.3161
SMILES:
NCc1nc2ccc(NC(=O)C=Cc3c(F)cccc3F)cc2[nH]1
: