Target
Substance-K receptor
Ligand
BDBM50116639
Substrate
Meas. Tech.
ChEBML_209037
Ki
12600±n/a nM
Citation
 Capozzi, GGiannini, SMenichetti, SNativi, CGiolitti, APatacchini, RPerrotta, EAltamura, MAlberto Maggi, C Design, synthesis and biological activity of carbohydrate-containing peptidomimetics as new ligands for the human tachykinin NK-2 receptor. Bioorg Med Chem Lett 12:2263-6 (2002)  
Target
Name:
Substance-K receptor
Synonyms:
NK-2 receptor NK2R NKNAR Neurokinin A receptor Neurokinin-2 (NK-2) SKR TACR2 Tachykinin receptor 2 (NK2) | hnk-3
Type:
Protein
Mol. Mass.:
44455.78
Organism:
Homo sapiens (Human)
Description:
P21452
Residue:
398
  
Inhibitor
Name:
BDBM50116639
Synonyms:
7,8-Bis-benzyloxy-6-benzyloxymethyl-3-methyl-6,7,8,8a-tetrahydro-4aH-4,5-dioxa-1-thia-naphthalene-2-carboxylic acid ethyl ester | CHEMBL308613
Type:
Small organic molecule
Emp. Form.:
C33H36O7S
Mol. Mass.:
576.7
SMILES:
CCOC(=O)C1=C(C)OC2OC(COCc3ccccc3)C(OCc3ccccc3)C(OCc3ccccc3)C2S1
: