Target
Substance-K receptor
Ligand
BDBM50116640
Substrate
Meas. Tech.
ChEBML_209037
Ki
>10000±n/a nM
Citation
 Capozzi, GGiannini, SMenichetti, SNativi, CGiolitti, APatacchini, RPerrotta, EAltamura, MAlberto Maggi, C Design, synthesis and biological activity of carbohydrate-containing peptidomimetics as new ligands for the human tachykinin NK-2 receptor. Bioorg Med Chem Lett 12:2263-6 (2002)  
Target
Name:
Substance-K receptor
Synonyms:
NK-2 receptor NK2R NKNAR Neurokinin A receptor Neurokinin-2 (NK-2) SKR TACR2 Tachykinin receptor 2 (NK2) | hnk-3
Type:
Protein
Mol. Mass.:
44455.78
Organism:
Homo sapiens (Human)
Description:
P21452
Residue:
398
  
Inhibitor
Name:
BDBM50116640
Synonyms:
8-Benzyloxy-6-benzyloxymethyl-7-hydroxy-3-methyl-1-oxo-6,7,8,8a-tetrahydro-1H,4aH-4,5-dioxa-1lambda*4*-thia-naphthalene-2-carboxylic acid ethyl ester | CHEMBL306858
Type:
Small organic molecule
Emp. Form.:
C26H28O8S
Mol. Mass.:
500.561
SMILES:
CCOC(=O)C1=C(C)OC2=C(C(OCc3ccccc3)C(O)C(COCc3ccccc3)O2)S1=O
: