Target
Nitric oxide synthase, endothelial
Ligand
BDBM50116674
Substrate
Meas. Tech.
ChEBML_64984
IC50
360±n/a nM
Citation
 Kawanaka, YKobayashi, KKusuda, STatsumi, TMurota, MNishiyama, THisaichi, KFujii, AHirai, KNaka, MKomeno, MNakai, HToda, M Design and synthesis of orally bioavailable inhibitors of inducible nitric oxide synthase. Part 1: synthesis and biological evaluation of dihydropyridin-2-imines. Bioorg Med Chem Lett 12:2291-4 (2002)  
Target
Name:
Nitric oxide synthase, endothelial
Synonyms:
Constitutive NOS Endothelial NOS NOS type III NOS3_HUMAN Nitric oxide synthase (inducible and endothelial) Nitric-oxide synthase (endothelial and brain) eNOS
Type:
Enzyme Catalytic Domain
Mol. Mass.:
133297.84
Organism:
Homo sapiens (Human)
Description:
P29474
Residue:
1203
  
Inhibitor
Name:
BDBM50116674
Synonyms:
6-Allyl-4-methyl-5,6-dihydro-1H-pyridin-(2Z)-ylideneamine | CHEMBL72316
Type:
Small organic molecule
Emp. Form.:
C9H14N2
Mol. Mass.:
150.2209
SMILES:
CC1=CC(N)=NC(CC=C)C1
: