Target
Substance-P receptor
Ligand
BDBM50116715
Substrate
Meas. Tech.
ChEBML_205873
Ki
0.600000±n/a nM
Citation
 Reichard, GAGrice, CAShih, NYSpitler, JMajmundar, SWang, SDPaliwal, SAnthes, JCPiwinski, JJ Preparation of oxime dual NK(1)/NK(2) antagonists with reduced NK(3) affinity. Bioorg Med Chem Lett 12:2355-8 (2002)  
Target
Name:
Substance-P receptor
Synonyms:
NK-1 receptor NK1 Receptor NK1R_HUMAN Neurokinin-1 (NK-1) SPR TACR1 Tachykinin receptor 1 (NK1) | tachykinin
Type:
G Protein-Coupled Receptor (GPCR)
Mol. Mass.:
46254.43
Organism:
Homo sapiens (Human)
Description:
P25103
Residue:
407
  
Inhibitor
Name:
BDBM50116715
Synonyms:
3,5-Dichloro-N-{(R)-3-(3,4-dichloro-phenyl)-5-{4-[3-(N-hydroxycarbamimidoylmethyl)-2-oxo-tetrahydro-pyrimidin-1-yl]-piperidin-1-yl}-2-[(Z)-methoxyimino]-pentyl}-N-methyl-benzamide | CHEMBL404599
Type:
Small organic molecule
Emp. Form.:
C31H39Cl4N7O4
Mol. Mass.:
715.498
SMILES:
CO\N=C(/CN(C)C(=O)c1cc(Cl)cc(Cl)c1)[C@H](CCN1CCC(CC1)N1CCCN(CC(=N)NO)C1=O)c1ccc(Cl)c(Cl)c1
: