Target
Neuromedin-K receptor
Ligand
BDBM50116721
Substrate
Meas. Tech.
ChEBML_209564
Ki
0.600000±n/a nM
Citation
 Reichard, GAGrice, CAShih, NYSpitler, JMajmundar, SWang, SDPaliwal, SAnthes, JCPiwinski, JJ Preparation of oxime dual NK(1)/NK(2) antagonists with reduced NK(3) affinity. Bioorg Med Chem Lett 12:2355-8 (2002)  
Target
Name:
Neuromedin-K receptor
Synonyms:
NK-3 receptor NK3R NKR Neurokinin B receptor Neuromedin-3 receptor (NK-3R) Neuromedin-K receptor Neuromedin-K receptor (NK3) TAC3R Tachykinin receptor 3 | Tachykinin receptor 3 (NK3)
Type:
Enzyme
Mol. Mass.:
52221.96
Organism:
Homo sapiens (Human)
Description:
P29371
Residue:
465
  
Inhibitor
Name:
BDBM50116721
Synonyms:
3,5-Dichloro-N-{(R)-3-(3,4-dichloro-phenyl)-5-[4-(3-isopropyl-2-oxo-tetrahydro-pyrimidin-1-yl)-piperidin-1-yl]-2-[(Z)-methoxyimino]-pentyl}-N-methyl-benzamide | CHEMBL76437
Type:
Small organic molecule
Emp. Form.:
C32H41Cl4N5O3
Mol. Mass.:
685.512
SMILES:
CO\N=C(/CN(C)C(=O)c1cc(Cl)cc(Cl)c1)[C@H](CCN1CCC(CC1)N1CCCN(C(C)C)C1=O)c1ccc(Cl)c(Cl)c1
: