Target
Substance-K receptor
Ligand
BDBM50116717
Substrate
Meas. Tech.
ChEBML_209036
Ki
0.400000±n/a nM
Citation
 Reichard, GAGrice, CAShih, NYSpitler, JMajmundar, SWang, SDPaliwal, SAnthes, JCPiwinski, JJ Preparation of oxime dual NK(1)/NK(2) antagonists with reduced NK(3) affinity. Bioorg Med Chem Lett 12:2355-8 (2002)  
Target
Name:
Substance-K receptor
Synonyms:
NK-2 receptor NK2R NKNAR Neurokinin A receptor Neurokinin-2 (NK-2) SKR TACR2 Tachykinin receptor 2 (NK2) | hnk-3
Type:
Protein
Mol. Mass.:
44455.78
Organism:
Homo sapiens (Human)
Description:
P21452
Residue:
398
  
Inhibitor
Name:
BDBM50116717
Synonyms:
3,5-Dichloro-N-[(R)-3-(3,4-dichloro-phenyl)-2-[(Z)-methoxyimino]-5-((R)-3-methylcarbamoylmethyl-2-oxo-[1,4']bipiperidinyl-1'-yl)-pentyl]-N-methyl-benzamide SCH-206272
Type:
Small organic molecule
Emp. Form.:
C33H41Cl4N5O4
Mol. Mass.:
713.522
SMILES:
CNC(=O)C[C@H]1CCCN(C2CCN(CC[C@@H](\C(CN(C)C(=O)c3cc(Cl)cc(Cl)c3)=N\OC)c3ccc(Cl)c(Cl)c3)CC2)C1=O
: