Target
5-hydroxytryptamine receptor 7
Ligand
BDBM50116963
Substrate
Meas. Tech.
ChEBML_3696
Ki
2.1±n/a nM
Citation
 Isaac, MBXin, TO'Brien, ASt-Martin, DNaismith, AMacLean, NWilson, JDemchyshyn, LTehim, ASlassi, A 1-(Bicyclopiperazinyl)ethylindoles and 1-(homopiperazinyl)ethyl-indoles as highly selective and potent 5-HT(7) receptor ligands. Bioorg Med Chem Lett 12:2451-4 (2002)  
Target
Name:
5-hydroxytryptamine receptor 7
Synonyms:
5-HT-7 5-HT7 5-HT7S 5HT7 HTR7 | Serotonin receptor 7
Type:
G Protein-Coupled Receptor (GPCR)
Mol. Mass.:
53573.08
Organism:
Homo sapiens (Human)
Description:
P34969
Residue:
479
  
Inhibitor
Name:
BDBM50116963
Synonyms:
2a-(4-(4-phenyl-5,6-dihydropyridin-1(2H)-yl)butyl)-2a,3,4,5-tetrahydrobenzo[cd]indol-2(1H)-one CHEMBL69257
Type:
Small organic molecule
Emp. Form.:
C26H30N2O
Mol. Mass.:
386.5292
SMILES:
O=C1Nc2cccc3CCCC1(CCCCN1CCC(=CC1)c1ccccc1)c23
: