Target
Mycothiol S-conjugate amidase
Ligand
BDBM50117087
Substrate
Meas. Tech.
ChEBML_140808
IC50
185000±n/a nM
Citation
 Nicholas, GMEckman, LLRay, SHughes, ROPfefferkorn, JABarluenga, SNicolaou, KCBewley, CA Bromotyrosine-derived natural and synthetic products as inhibitors of mycothiol-S-conjugate amidase. Bioorg Med Chem Lett 12:2487-90 (2002)  
Target
Name:
Mycothiol S-conjugate amidase
Synonyms:
MCA_MYCTU | mca
Type:
PROTEIN
Mol. Mass.:
32719.79
Organism:
Mycobacterium tuberculosis
Description:
ChEMBL_626858
Residue:
288
  
Inhibitor
Name:
BDBM50117087
Synonyms:
CHEMBL194868 N-[2-(4-Amino-phenyldisulfanyl)-ethyl]-3-(3-bromo-phenyl)-2-[(Z)-hydroxyimino]-propionamide
Type:
Small organic molecule
Emp. Form.:
C17H18BrN3O2S2
Mol. Mass.:
440.378
SMILES:
Nc1ccc(SSCCNC(=O)C(Cc2cccc(Br)c2)N=O)cc1
: