Target
Adenosine receptor A1
Ligand
BDBM50117239
Substrate
Meas. Tech.
ChEMBL_27910 (CHEMBL642158)
Ki
1310±n/a nM
Citation
 Okamura, TKurogi, YNishikawa, HHashimoto, KFujiwara, HNagao, Y 1,2,4-Triazolo[5,1-i]purine derivatives as highly potent and selective human adenosine A(3) receptor ligands. J Med Chem 45:3703-8 (2002)  
Target
Name:
Adenosine receptor A1
Synonyms:
A1 adenosine receptor (hA1) AA1R_HUMAN ADORA1 Adenosine A1-receptor Adenosine receptor A1 (hA1) | Adenosine transporter (AdT)
Type:
G Protein-Coupled Receptor (GPCR)
Mol. Mass.:
36520.92
Organism:
Homo sapiens (Human)
Description:
P30542
Residue:
326
  
Inhibitor
Name:
BDBM50117239
Synonyms:
CHEMBL123462 | [4-(5-Butyl-3H-[1,2,4]triazolo[5,1-i]purin-8-yl)-phenyl]-dimethyl-amine
Type:
Small organic molecule
Emp. Form.:
C18H21N7
Mol. Mass.:
335.4062
SMILES:
CCCCc1nc2nc[nH]c2c2nc(nn12)-c1ccc(cc1)N(C)C
: