Target
Platelet-activating factor acetylhydrolase
Ligand
BDBM50117802
Substrate
Meas. Tech.
ChEBML_156373
IC50
0.120000±n/a nM
Citation
 Blackie, JABloomer, JCBrown, MJCheng, HYElliott, RLHammond, BHickey, DMIfe, RJLeach, CALewis, VAMacphee, CHMilliner, KJMoores, KEPinto, ILSmith, SAStansfield, IGStanway, SJTaylor, MATheobald, CJWhittaker, CM The discovery of SB-435495. A potent, orally active inhibitor of lipoprotein-associated phospholipase A(2) for evaluation in man. Bioorg Med Chem Lett 12:2603-6 (2002)  
Target
Name:
Platelet-activating factor acetylhydrolase
Synonyms:
1-alkyl-2-acetylglycerophosphocholine esterase LDL-PLA(2) PAF 2-acylhydrolase PAFAH PLA2G7 | Platelet-activating factor acetylhydrolase
Type:
PROTEIN
Mol. Mass.:
50084.41
Organism:
Homo sapiens (Human)
Description:
ChEMBL_156212
Residue:
441
  
Inhibitor
Name:
BDBM50117802
Synonyms:
CHEMBL87100 | N-(2-Ethylamino-ethyl)-2-[2-(4-fluoro-benzylsulfanyl)-5-(1-methyl-1H-pyrazol-4-ylmethyl)-4-oxo-4H-pyrimidin-1-yl]-N-(4'-trifluoromethyl-biphenyl-4-ylmethyl)-acetamide
Type:
Small organic molecule
Emp. Form.:
C36H36F4N6O2S
Mol. Mass.:
692.769
SMILES:
CCNCCN(Cc1ccc(cc1)-c1ccc(cc1)C(F)(F)F)C(=O)Cn1cc(Cc2cnn(C)c2)c(=O)nc1SCc1ccc(F)cc1
: