Target
Dimer of Protein farnesyltransferase subunit beta
Ligand
BDBM50117934
Substrate
Meas. Tech.
ChEMBL_161567 (CHEMBL768930)
IC50
>190±n/a nM
Citation
 Taveras, AGAki, CChao, JDoll, RJLalwani, TGirijavallabhan, VStrickland, CLWindsor, WTWeber, PHollinger, FSnow, MPatton, RKirschmeier, PJames, LLiu, MNomeir, A Exploring the role of bromine at C(10) of (+)-4-[2-[4-(8-chloro-3,10-dibromo- 6,11-dihydro-5H-benzo[5,6]cyclohepta[1,2-b]pyridin-11(R)-yl)-1-piperidinyl]-2- oxoethyl]-1-piperidinecarboxamide (Sch-66336): the discovery of indolocycloheptapyridine inhibitors of farnesyl protein transferase. J Med Chem 45:3854-64 (2002)  
Target
Name:
Dimer of Protein farnesyltransferase subunit beta
Synonyms:
Protein Farnesyltransferase (PFT) Chain B
Type:
Mol. Mass.:
Description:
ASSAY_ID of EBI is 51428
Components:
This complex has 3 components.
Component 1
Name:
Protein farnesyltransferase subunit beta
Synonyms:
CAAX farnesyltransferase subunit alpha FNTB FTase-alpha GGTase-I-alpha Protein farnesyl/geranylgeranyl transferase Protein farnesyltransferase subunit beta Protein farnesyltransferase/geranylgeranyltransferase type-1 subunit alpha Ras proteins prenyltransferase subunit beta | Type I protein geranyl-geranyltransferase subunit alpha
Type:
Enzyme Subunit
Mol. Mass.:
48766.02
Organism:
Homo sapiens (Human)
Description:
Protein farnesyltransferase subunit beta
Residue:
437
  
Component 2
Name:
Protein farnesyltransferase subunit beta
Synonyms:
CAAX farnesyltransferase subunit alpha FNTB FTase-alpha GGTase-I-alpha Protein farnesyl/geranylgeranyl transferase Protein farnesyltransferase subunit beta Protein farnesyltransferase/geranylgeranyltransferase type-1 subunit alpha Ras proteins prenyltransferase subunit beta | Type I protein geranyl-geranyltransferase subunit alpha
Type:
Enzyme Subunit
Mol. Mass.:
48766.02
Organism:
Homo sapiens (Human)
Description:
Protein farnesyltransferase subunit beta
Residue:
437
  
Inhibitor
Name:
BDBM50117934
Synonyms:
(+ )1-[4-(4-chloro-1,3-dimethyl-3,6,7,12-tetrahydropyrido[2',3':4,5]cyclohepta[e]indol-12-yl)hexahydro-1-pyridinyl]-2-(1-hydroxy-4-pyridiniumyl)-1-ethanone | CHEMBL125344
Type:
Small organic molecule
Emp. Form.:
C30H31ClN4O2
Mol. Mass.:
515.046
SMILES:
Cc1cn(C)c2c(Cl)cc3CCc4cccnc4C(C4CCN(CC4)C(=O)Cc4cc[n+]([O-])cc4)c3c12
: