Target
5-hydroxytryptamine receptor 1A
Ligand
BDBM50118338
Substrate
Meas. Tech.
ChEMBL_1140 (CHEMBL616085)
Ki
913.0±n/a nM
Citation
 Orús, LPérez-Silanes, SOficialdegui, AMMartínez-Esparza, JDel Castillo, JCMourelle, MLanger, TGuccione, SDonzella, GKrovat, EMPoptodorov, KLasheras, BBallaz, SHervías, ITordera, RDel Río, JMonge, A Synthesis and molecular modeling of new 1-aryl-3-[4-arylpiperazin-1-yl]-1-propane derivatives with high affinity at the serotonin transporter and at 5-HT(1A) receptors. J Med Chem 45:4128-39 (2002)  
Target
Name:
5-hydroxytryptamine receptor 1A
Synonyms:
5-HT-1A 5-HT1A 5-hydroxytryptamine receptor 1A (5HT1A) 5ht1a Htr1a Serotonin 1a (5-HT1a) receptor/Adrenergic receptor alpha-1 | Serotonin receptor 1A
Type:
G Protein-Coupled Receptor (GPCR)
Mol. Mass.:
46445.29
Organism:
Rattus norvegicus (rat)
Description:
Binding assays were performed using rat hippocampal membranes.
Residue:
422
  
Inhibitor
Name:
BDBM50118338
Synonyms:
1-(benzo[b]thiophen-3-yl)-3-(4-(benzo[b]thiophen-5-yl)piperazin-1-yl)propan-1-ol CHEMBL341434
Type:
Small organic molecule
Emp. Form.:
C23H24N2OS2
Mol. Mass.:
408.579
SMILES:
OC(CCN1CCN(CC1)c1ccc2sccc2c1)c1csc2ccccc12
: