Target
ATP-binding cassette sub-family C member 8/ATP-sensitive inward rectifier potassium channel 11
Ligand
BDBM50118348
Substrate
Meas. Tech.
ChEMBL_206298 (CHEMBL810543)
IC50
899000±n/a nM
Citation
 Nielsen, FEBodvarsdottir, TBWorsaae, AMacKay, PStidsen, CEBoonen, HCPridal, LArkhammar, POWahl, PYnddal, LJunager, FDragsted, NTagmose, TMMogensen, JPKoch, ATreppendahl, SPHansen, JB 6-Chloro-3-alkylamino-4H-thieno[3,2-e]-1,2,4-thiadiazine 1,1-dioxide derivatives potently and selectively activate ATP sensitive potassium channels of pancreatic beta-cells. J Med Chem 45:4171-87 (2002)  
Target
Name:
ATP-binding cassette sub-family C member 8/ATP-sensitive inward rectifier potassium channel 11
Synonyms:
Potassium channel, inwardly rectifying, subfamily J, member 11/Sulfonylurea receptor 1 | Sulfonylurea receptor 1, Kir6.2
Type:
Mol. Mass.:
Description:
ASSAY_ID of EBI is 39363
Components:
This complex has 2 components.
Component 1
Name:
ATP-binding cassette sub-family C member 8
Synonyms:
ABCC8 ATP-binding cassette sub-family C member 8 HRINS SUR Sulfonylurea receptor 1 | Sulfonylurea receptors
Type:
PROTEIN
Mol. Mass.:
177013.37
Organism:
Homo sapiens (Human)
Description:
ChEMBL_1436733
Residue:
1581
  
Component 2
Name:
ATP-sensitive inward rectifier potassium channel 11
Synonyms:
ATP-sensitive inward rectifier potassium channel 11 Inward rectifier K(+) channel Kir6.2 KCNJ11 Potassium channel, inwardly rectifying, subfamily J, member 11 Sulfonylurea receptor 2, Kir6.2
Type:
Enzyme Catalytic Domain
Mol. Mass.:
43549.41
Organism:
Homo sapiens (Human)
Description:
Potassium channel (ATP modulatory) 0 0::Q14654
Residue:
390
  
Component 3
Name:
ATP-binding cassette sub-family C member 8
Synonyms:
ABCC8 ATP-binding cassette sub-family C member 8 HRINS SUR Sulfonylurea receptor 1 | Sulfonylurea receptors
Type:
PROTEIN
Mol. Mass.:
177013.37
Organism:
Homo sapiens (Human)
Description:
ChEMBL_1436733
Residue:
1581
  
Inhibitor
Name:
BDBM50118348
Synonyms:
(2-Chloro-7,7-dioxo-4,7-dihydro-1,7lambda*6*-dithia-4,6-diaza-inden-5-yl)-(1,1-dimethyl-propyl)-amine | CHEMBL135091
Type:
Small organic molecule
Emp. Form.:
C10H14ClN3O2S2
Mol. Mass.:
307.82
SMILES:
CCC(C)(C)NC1=Nc2cc(Cl)sc2S(=O)(=O)N1
: