Target
Papain
Ligand
BDBM50409592
Substrate
Meas. Tech.
ChEMBL_222141 (CHEMBL822229)
Ki
0.78±n/a nM
Citation
 Wieczerzak, EDrabik, PŁankiewicz, LOldziej, SGrzonka, ZAbrahamson, MGrubb, ABrömme, D Azapeptides structurally based upon inhibitory sites of cystatins as potent and selective inhibitors of cysteine proteases. J Med Chem 45:4202-11 (2002)  
Target
Name:
Papain
Synonyms:
Allergen=Car p 1 PPI | Papaya proteinase I
Type:
Enzyme
Mol. Mass.:
38923.01
Organism:
Carica papaya
Description:
Papain was purchased from Sigma, Germany.
Residue:
345
  
Inhibitor
Name:
BDBM50409592
Synonyms:
CHEMBL2028908
Type:
Small organic molecule
Emp. Form.:
C31H51N11O8
Mol. Mass.:
705.8055
SMILES:
CC(C)C[C@H](NC(=O)[C@H](CCCNC(N)=N)NC(=O)OCc1ccccc1)C(=O)N[C@@H](C(C)C)C(=O)NNC(=O)N[C@@H](C)C(=O)NCC(N)=O
: