Target
Sodium-dependent serotonin transporter
Ligand
BDBM50049363
Substrate
Meas. Tech.
ChEMBL_202159 (CHEMBL808862)
Ki
68±n/a nM
Citation
 Prisinzano, TGreiner, EJohnson, EMDersch, CMMarcus, JPartilla, JSRothman, RBJacobson, AERice, KC Piperidine analogues of 1-[2-[bis(4-fluorophenyl)methoxy]ethyl]-4-(3-phenylpropyl)piperazine (GBR 12909): high affinity ligands for the dopamine transporter. J Med Chem 45:4371-4 (2002)  
Target
Name:
Sodium-dependent serotonin transporter
Synonyms:
5-HT Transporter 5HTT SC6A4_HUMAN SLC6A4 Serotonin transporter (5HTT) Sodium-dependent serotonin transporter (SERT) | Solute carrier family 6 member 4
Type:
Multi-pass membrane protein
Mol. Mass.:
70322.51
Organism:
Homo sapiens (Human)
Description:
P31645
Residue:
630
  
Inhibitor
Name:
BDBM50049363
Synonyms:
4-{2-[Bis-(4-fluoro-phenyl)-methoxy]-ethyl}-1-(3-phenyl-propyl)-piperidine | CHEMBL77867
Type:
Small organic molecule
Emp. Form.:
C29H33F2NO
Mol. Mass.:
449.5752
SMILES:
Fc1ccc(cc1)C(OCCC1CCN(CCCc2ccccc2)CC1)c1ccc(F)cc1
: