Target
Receptor-type tyrosine-protein phosphatase alpha
Ligand
BDBM50118764
Substrate
Meas. Tech.
ChEMBL_162603 (CHEMBL771315)
pH
5.5±n/a
Ki
200000±n/a nM
Comments
extracted
Citation
 Andersen, HSOlsen, OHIversen, LFSørensen, ALMortensen, SBChristensen, MSBranner, SHansen, TKLau, JFJeppesen, LMoran, EJSu, JBakir, FJudge, LShahbaz, MCollins, TVo, TNewman, MJRipka, WCMøller, NP Discovery and SAR of a novel selective and orally bioavailable nonpeptide classical competitive inhibitor class of protein-tyrosine phosphatase 1B. J Med Chem 45:4443-59 (2002)  
Target
Name:
Receptor-type tyrosine-protein phosphatase alpha
Synonyms:
PTPA PTPRA_HUMAN Protein-tyrosine phosphatase alpha
Type:
Enzyme
Mol. Mass.:
90719.02
Organism:
Homo sapiens (Human)
Description:
P18433
Residue:
802
  
Inhibitor
Name:
BDBM50118764
Synonyms:
3-(carboxyformamido)-5-(thiophen-3-yl)thiophene-2-carboxylic acid 4-(carboxyformamido)-2,3'-bithiophene-5-carboxylic acid | CHEMBL138575
Type:
Small organic molecule
Emp. Form.:
C11H7NO5S2
Mol. Mass.:
297.307
SMILES:
OC(=O)C(=O)Nc1cc(sc1C(O)=O)-c1ccsc1
: