Target
DNA polymerase alpha catalytic subunit
Ligand
BDBM50118822
Substrate
Meas. Tech.
ChEMBL_44100 (CHEMBL653085)
Ki
548000±n/a nM
Citation
 Rose, JDParker, WBSomeya, HShaddix, SCMontgomery, JASecrist, JA Enhancement of nucleoside cytotoxicity through nucleotide prodrugs. J Med Chem 45:4505-12 (2002)  
Target
Name:
DNA polymerase alpha catalytic subunit
Synonyms:
DNA polymerase (alpha/delta/epsilon) DPOLA_HUMAN POLA1
Type:
PROTEIN
Mol. Mass.:
165895.25
Organism:
Homo sapiens (Human)
Description:
ChEMBL_1365493
Residue:
1462
  
Inhibitor
Name:
BDBM50118822
Synonyms:
2,2-Dimethyl-propionic acid [5-(6-amino-8-bromo-purin-9-yl)-3-hydroxy-tetrahydro-furan-2-ylmethoxy]-(2,2-dimethyl-propionyloxymethoxy)-phosphoryloxymethyl ester | CHEMBL178078
Type:
Small organic molecule
Emp. Form.:
C22H33BrN5O10P
Mol. Mass.:
638.403
SMILES:
CC(C)(C)C(=O)OCOP(=O)(OCOC(=O)C(C)(C)C)OC[C@H]1O[C@H](C[C@@H]1O)n1c(Br)nc2c(N)ncnc12
: