Target
Estrogen receptor
Ligand
BDBM50118992
Substrate
Meas. Tech.
ChEBML_67839
IC50
380±n/a nM
Citation
 Smith, RAChen, JMader, MMMuegge, IMoehler, UKatti, SMarrero, DStirtan, WGWeaver, DRXiao, HCarley, W Solid-phase synthesis and investigation of benzofurans as selective estrogen receptor modulators. Bioorg Med Chem Lett 12:2875-8 (2002)  
Target
Name:
Estrogen receptor
Synonyms:
ESR1_RAT Esr1 Nr3a1 | estrogen alpha
Type:
Enzyme Catalytic Domain
Mol. Mass.:
67045.89
Organism:
RAT
Description:
estrogen alpha 0 RAT::P06211
Residue:
600
  
Inhibitor
Name:
BDBM50118992
Synonyms:
(2-Chloro-phenyl)-[6-hydroxy-3-(2-methoxy-benzyl)-benzofuran-2-yl]-methanone | CHEMBL99335
Type:
Small organic molecule
Emp. Form.:
C23H17ClO4
Mol. Mass.:
392.832
SMILES:
COc1ccccc1Cc1c(oc2cc(O)ccc12)C(=O)c1ccccc1Cl
: