Target
Estrogen receptor
Ligand
BDBM50119004
Substrate
Meas. Tech.
ChEBML_67839
IC50
200±n/a nM
Citation
 Smith, RAChen, JMader, MMMuegge, IMoehler, UKatti, SMarrero, DStirtan, WGWeaver, DRXiao, HCarley, W Solid-phase synthesis and investigation of benzofurans as selective estrogen receptor modulators. Bioorg Med Chem Lett 12:2875-8 (2002)  
Target
Name:
Estrogen receptor
Synonyms:
ESR1_RAT Esr1 Nr3a1 | estrogen alpha
Type:
Enzyme Catalytic Domain
Mol. Mass.:
67045.89
Organism:
RAT
Description:
estrogen alpha 0 RAT::P06211
Residue:
600
  
Inhibitor
Name:
BDBM50119004
Synonyms:
(3-Fluoro-phenyl)-(6-hydroxy-3-naphthalen-1-yl-benzofuran-2-yl)-methanone | CHEMBL96991
Type:
Small organic molecule
Emp. Form.:
C25H15FO3
Mol. Mass.:
382.3832
SMILES:
Oc1ccc2c(c(oc2c1)C(=O)c1cccc(F)c1)-c1cccc2ccccc12
: