Target
Estrogen receptor
Ligand
BDBM50119006
Substrate
Meas. Tech.
ChEMBL_67660 (CHEMBL673853)
IC50
190±n/a nM
Citation
 Smith, RAChen, JMader, MMMuegge, IMoehler, UKatti, SMarrero, DStirtan, WGWeaver, DRXiao, HCarley, W Solid-phase synthesis and investigation of benzofurans as selective estrogen receptor modulators. Bioorg Med Chem Lett 12:2875-8 (2002)  
Target
Name:
Estrogen receptor
Synonyms:
ESR1_RAT Esr1 Nr3a1 | estrogen alpha
Type:
Enzyme Catalytic Domain
Mol. Mass.:
67045.89
Organism:
RAT
Description:
estrogen alpha 0 RAT::P06211
Residue:
600
  
Inhibitor
Name:
BDBM50119006
Synonyms:
(3,4-Dihydro-2H-benzo[b][1,4]dioxepin-7-yl)-(6-hydroxy-3-naphthalen-1-yl-benzofuran-2-yl)-methanone | CHEMBL95882
Type:
Small organic molecule
Emp. Form.:
C28H20O5
Mol. Mass.:
436.4554
SMILES:
Oc1ccc2c(c(oc2c1)C(=O)c1ccc2OCCCOc2c1)-c1cccc2ccccc12
: