Target
Coagulation factor VII
Ligand
BDBM50119050
Substrate
Meas. Tech.
ChEBML_48473
IC50
1.1±n/a nM
Citation
 Koehler, MFZobel, KBeresini, MHCaris, LDCombs, DPaasch, BDLazarus, RA Albumin affinity tags increase peptide half-life in vivo. Bioorg Med Chem Lett 12:2883-6 (2002)  
Target
Name:
Coagulation factor VII
Synonyms:
Eptacog alfa FA7_HUMAN Factor VIIa (fVIIa) SPCA serum prothrombin conversion accelerator
Type:
Enzyme
Mol. Mass.:
51599.89
Organism:
Homo sapiens (Human)
Description:
Residue:
466
  
Inhibitor
Name:
BDBM50119050
Synonyms:
ALCDNPRIDRWYCQFVEG peptide analogue CHEMBL409918
Type:
Small organic molecule
Emp. Form.:
C98H142N28O28S2
Mol. Mass.:
2224.477
SMILES:
CC[C@H](C)[C@H]1NC(=O)[C@H](CCCNC(N)=N)NC(=O)[C@H]2CCCN2C(=O)[C@H](CC(N)=O)NC(=O)[C@@H](CC(O)=O)NC(=O)[C@@H](CSSC[C@@H](NC(=O)[C@@H](Cc2ccc(O)cc2)NC(=O)[C@H](Cc2c[nH]c3ccccc23)NC(=O)[C@@H](CCCNC(N)=N)NC(=O)[C@H](CC(O)=O)NC1=O)C(=O)N[C@@H](CCC(N)=O)C(=O)N[C@@H](Cc1ccccc1)C(=O)N[C@@H](C(C)C)C(=O)N[C@@H](CCC(O)=O)C(=O)NCC(N)=O)NC(=O)[C@H](CC(C)C)NC(=O)[C@H](C)NC(C)=O
: