Target
Caspase-3
Ligand
BDBM50119234
Substrate
Meas. Tech.
ChEMBL_46676 (CHEMBL658634)
IC50
135±n/a nM
Citation
 Linton, SDKaranewsky, DSTernansky, RJChen, NGuo, XJahangiri, KGKalish, VJMeduna, SPRobinson, EDUllman, BRWu, JCPham, BKodandapani, LSmidt, RDiaz, JLFritz, LCvon Krosigk, URoggo, SSchmitz, ATomaselli, KJ Acyl dipeptides as reversible caspase inhibitors. Part 2: further optimization. Bioorg Med Chem Lett 12:2973-5 (2002)  
Target
Name:
Caspase-3
Synonyms:
Apopain CASP3 CPP-32 Caspase 3 Caspase-3 subunit p17 SCA-1 Yama protein | caspase-3 preproprotein
Type:
Hydrolase; heterotetramer of two heterodimers
Mol. Mass.:
31607.55
Organism:
Homo sapiens (Human)
Description:
Residue:
277
  
Inhibitor
Name:
BDBM50119234
Synonyms:
4-Methyl-2-[2-(naphthalen-1-yloxy)-acetylamino]-pentanoic acid (2-hydroxy-5-oxo-tetrahydro-furan-3-yl)-amide CHEMBL318386
Type:
Small organic molecule
Emp. Form.:
C22H26N2O6
Mol. Mass.:
414.4516
SMILES:
CC(C)C[C@H](NC(=O)COc1cccc2ccccc12)C(=O)N[C@H]1CC(=O)OC1O
: