Target
Caspase-1
Ligand
BDBM50119262
Substrate
Meas. Tech.
ChEMBL_46521 (CHEMBL659315)
IC50
33±n/a nM
Citation
 Linton, SDKaranewsky, DSTernansky, RJChen, NGuo, XJahangiri, KGKalish, VJMeduna, SPRobinson, EDUllman, BRWu, JCPham, BKodandapani, LSmidt, RDiaz, JLFritz, LCvon Krosigk, URoggo, SSchmitz, ATomaselli, KJ Acyl dipeptides as reversible caspase inhibitors. Part 2: further optimization. Bioorg Med Chem Lett 12:2973-5 (2002)  
Target
Name:
Caspase-1
Synonyms:
CASP1 Caspase ICE IL1BCE Interleukin-1 beta-converting enzyme
Type:
Enzyme
Mol. Mass.:
45154.13
Organism:
Homo sapiens (Human)
Description:
P29466
Residue:
404
  
Inhibitor
Name:
BDBM50119262
Synonyms:
4-Methyl-2-[2-(naphthalen-1-ylamino)-acetylamino]-pentanoic acid (2-hydroxy-5-oxo-tetrahydro-furan-3-yl)-amide | CHEMBL322631
Type:
Small organic molecule
Emp. Form.:
C22H27N3O5
Mol. Mass.:
413.4669
SMILES:
CC(C)CC(NC(=O)CNc1cccc2ccccc12)C(=O)N[C@H]1CC(=O)OC1O
: