Target
Melanocortin receptor 4
Ligand
BDBM50119371
Substrate
Meas. Tech.
ChEMBL_104242 (CHEMBL712747)
IC50
0.500000±n/a nM
Citation
 Sebhat, IKMartin, WJYe, ZBarakat, KMosley, RTJohnston, DBBakshi, RPalucki, BWeinberg, DHMacNeil, TKalyani, RNTang, RStearns, RAMiller, RRTamvakopoulos, CStrack, AMMcGowan, ECashen, DEDrisko, JEHom, GJHoward, ADMacIntyre, DEvan der Ploeg, LHPatchett, AANargund, RP Design and pharmacology of N-[(3R)-1,2,3,4-tetrahydroisoquinolinium- 3-ylcarbonyl]-(1R)-1-(4-chlorobenzyl)- 2-[4-cyclohexyl-4-(1H-1,2,4-triazol- 1-ylmethyl)piperidin-1-yl]-2-oxoethylamine (1), a potent, selective, melanocortin subtype-4 receptor agonist. J Med Chem 45:4589-93 (2002)  
Target
Name:
Melanocortin receptor 4
Synonyms:
MC4-R MC4R_HUMAN Melanocortin receptor 4 (MC-4) Melanocortin receptor 4 (MC4R)
Type:
Enzyme
Mol. Mass.:
36949.50
Organism:
Homo sapiens (Human)
Description:
P32245
Residue:
332
  
Inhibitor
Name:
BDBM50119371
Synonyms:
1,2,3,4-Tetrahydro-isoquinoline-3-carboxylic acid [1-(4-chloro-benzyl)-2-(4-cyclohexyl-4-[1,2,4]triazol-1-ylmethyl-piperidin-1-yl)-2-oxo-ethyl]-amide | CHEMBL334457
Type:
Small organic molecule
Emp. Form.:
C33H41ClN6O2
Mol. Mass.:
589.171
SMILES:
Clc1ccc(C[C@@H](NC(=O)[C@@H]2Cc3ccccc3CN2)C(=O)N2CCC(Cn3cncn3)(CC2)C2CCCCC2)cc1
: