Target
Melanocortin receptor 5
Ligand
BDBM50119368
Substrate
Meas. Tech.
ChEMBL_104267 (CHEMBL711704)
EC50
>3000±n/a nM
Citation
 Sebhat, IKMartin, WJYe, ZBarakat, KMosley, RTJohnston, DBBakshi, RPalucki, BWeinberg, DHMacNeil, TKalyani, RNTang, RStearns, RAMiller, RRTamvakopoulos, CStrack, AMMcGowan, ECashen, DEDrisko, JEHom, GJHoward, ADMacIntyre, DEvan der Ploeg, LHPatchett, AANargund, RP Design and pharmacology of N-[(3R)-1,2,3,4-tetrahydroisoquinolinium- 3-ylcarbonyl]-(1R)-1-(4-chlorobenzyl)- 2-[4-cyclohexyl-4-(1H-1,2,4-triazol- 1-ylmethyl)piperidin-1-yl]-2-oxoethylamine (1), a potent, selective, melanocortin subtype-4 receptor agonist. J Med Chem 45:4589-93 (2002)  
Target
Name:
Melanocortin receptor 5
Synonyms:
MC5-R Mc5r
Type:
PROTEIN
Mol. Mass.:
37062.06
Organism:
Rattus norvegicus
Description:
ChEMBL_11007
Residue:
325
  
Inhibitor
Name:
BDBM50119368
Synonyms:
(R)-1,2,3,4-Tetrahydro-isoquinoline-3-carboxylic acid [(R)-1-(4-chloro-benzyl)-2-(4-cyclohexyl-4-[1,2,4]triazol-1-ylmethyl-piperidin-1-yl)-2-oxo-ethyl]-amide (R)-N-((R)-1-(4-((1H-1,2,4-triazol-1-yl)methyl)-4-cyclohexylpiperidin-1-yl)-3-(4-chlorophenyl)-1-oxopropan-2-yl)-1,2,3,4-tetrahydroisoquinoline-3-carboxamide 1,2,3,4-Tetrahydro-isoquinoline-3-carboxylic acid [1-(4-chloro-benzyl)-2-(4-cyclohexyl-4-[1,2,4]triazol-1-ylmethyl-piperidin-1-yl)-2-oxo-ethyl]-amide THIQ
Type:
Small organic molecule
Emp. Form.:
C33H41ClN6O2
Mol. Mass.:
589.171
SMILES:
Clc1ccc(C[C@@H](NC(=O)[C@H]2Cc3ccccc3CN2)C(=O)N2CCC(Cn3cncn3)(CC2)C2CCCCC2)cc1
: