Target
Adenylate cyclase type 5
Ligand
BDBM50119835
Substrate
Meas. Tech.
ChEBML_31885
IC50
>200000±n/a nM
Citation
 Levy, DMarlowe, CKane-Maguire, KBao, MCherbavaz, DTomlinson, JSedlock, DScarborough, R Hydroxamate based inhibitors of adenylyl cyclase. Part 1: the effect of acyclic linkers on P-site binding. Bioorg Med Chem Lett 12:3085-8 (2002)  
Target
Name:
Adenylate cyclase type 5
Synonyms:
ADCY5 Adenylate cyclase | Adenylate cyclase type V
Type:
PROTEIN
Mol. Mass.:
138919.21
Organism:
Homo sapiens (Human)
Description:
ChEMBL_31732
Residue:
1261
  
Inhibitor
Name:
BDBM50119835
Synonyms:
CHEMBL319262 | {[3-(6-Amino-purin-9-yl)-propyl]-tert-butoxycarbonyl-amino}-acetic acid
Type:
Small organic molecule
Emp. Form.:
C15H22N6O4
Mol. Mass.:
350.373
SMILES:
CC(C)(C)OC(=O)N(CCCn1cnc2c(N)ncnc12)CC(O)=O
: