Target
5-hydroxytryptamine receptor 2C
Ligand
BDBM50119867
Substrate
Meas. Tech.
ChEBML_3045
Ki
5.5±n/a nM
Citation
 Bózsing, DSimonek, ISimig, GJakóczi, IGacsályi, ILévay, GTihanyi, KSchmidt, E Synthesis and evaluation of 5-HT(2A) and 5-HT(2C) receptor binding affinities of novel pyrimidine derivatives. Bioorg Med Chem Lett 12:3097-9 (2002)  
Target
Name:
5-hydroxytryptamine receptor 2C
Synonyms:
5-HT-1C 5-HT1C 5-HT2C-INI 5-HTR2C 5-hydroxytryptamine receptor 2C (5-HT-2C) 5HT-1C HTR1C Serotonin (5-HT3) receptor Serotonin Receptor 2C
Type:
G Protein-Coupled Receptor (GPCR)
Mol. Mass.:
51836.79
Organism:
Homo sapiens (Human)
Description:
P28335
Residue:
458
  
Inhibitor
Name:
BDBM50119867
Synonyms:
5-(2-Methoxy-benzyl)-2-{2-[4-(3-trifluoromethyl-benzyl)-piperazin-1-yl]-ethylsulfanyl}-pyrimidine-4,6-diamine | CHEMBL107847
Type:
Small organic molecule
Emp. Form.:
C26H31F3N6OS
Mol. Mass.:
532.624
SMILES:
COc1ccccc1Cc1c(N)nc(SCCN2CCN(Cc3cccc(c3)C(F)(F)F)CC2)nc1N
: