Target
Tyrosine-protein kinase Lck
Ligand
BDBM50120121
Substrate
Meas. Tech.
ChEBML_96910
IC50
14±n/a nM
Citation
 Chen, PIwanowicz, EJNorris, DGu, HHLin, JMoquin, RVDas, JWityak, JSpergel, SHde Fex, HPang, SPitt, SShen, DRSchieven, GLBarrish, JC Synthesis and SAR of novel imidazoquinoxaline-based Lck inhibitors: improvement of cell potency. Bioorg Med Chem Lett 12:3153-6 (2002)  
Target
Name:
Tyrosine-protein kinase Lck
Synonyms:
2.7.10.2 LCK_HUMAN Leukocyte C-terminal Src kinase Lymphocyte-specific protein tyrosine kinase Protein YT16 Proto-oncogene tyrosine-protein kinase LCK T cell-specific protein-tyrosine kinase
Type:
Mol. Mass.:
57987.83
Organism:
Homo sapiens (Human)
Description:
P06239
Residue:
509
  
Inhibitor
Name:
BDBM50120121
Synonyms:
(7-Bromo-imidazo[1,5-a]quinoxalin-4-yl)-(2-chloro-6-methyl-phenyl)-amine CHEMBL86068
Type:
Small organic molecule
Emp. Form.:
C17H12BrClN4
Mol. Mass.:
387.661
SMILES:
Cc1cccc(Cl)c1Nc1nc2cc(Br)ccc2n2cncc12
: